{"text_format":"1","workbook":"xlsx","n_sheets":3,"sheets":["Client","H&D","BD Client"],"not_rendered":{"charts":0,"images":0,"macros":1,"external_links":0,"defined_names":1,"comments":0,"pivot_tables":0},"unopened":[],"bounds":{"document_bytes":16777216,"sheet_cells":100000,"rows_first":2000,"rows_last":500,"rows_between":2000,"halvings":0,"cell_chars":16384,"cell_head_chars":4096},"cells_cut":0,"cells_raw":0,"read":"whole","date_system":"1900"}

{"sheet":"Client","index":0,"n_rows":102,"n_cols":10,"rows_kept":102,"cut":false,"hidden":false,"merged":[[15,3,15,4],[65,9,65,10],[66,3,66,5],[66,7,66,8],[67,3,67,7],[46,9,46,10],[47,3,47,5],[48,3,48,5],[48,7,48,8],[49,3,49,5],[49,7,49,9],[16,3,16,7],[19,3,19,4],[19,6,19,7],[21,3,21,5],[18,3,18,8],[62,0,67,1],[62,3,62,7],[63,3,63,7],[64,3,64,8],[65,3,65,4],[65,6,65,7],[53,0,61,1],[53,2,53,4],[58,3,58,5],[59,3,59,5],[60,3,60,5],[43,0,52,1],[43,3,43,7],[44,3,44,7],[45,3,45,8],[46,3,46,4],[46,6,46,7],[50,3,50,5],[51,3,51,5],[52,3,52,7],[0,0,0,11],[11,1,11,2],[1,0,1,2],[2,0,2,2],[3,0,3,2],[4,0,4,2],[5,0,5,2],[6,0,6,2],[7,1,7,2],[8,1,8,2],[9,1,9,2],[10,1,10,2],[20,3,20,5],[36,3,36,7],[19,9,19,10],[35,0,40,1],[38,3,38,4],[38,6,38,7],[39,3,39,5],[40,3,40,7],[35,3,35,7],[37,3,37,8],[16,0,25,1],[17,3,17,7],[22,3,22,5],[22,7,22,9],[23,3,23,5],[26,0,34,1],[24,3,24,5],[38,9,38,10],[39,7,39,8],[25,3,25,7],[21,7,21,8],[26,2,26,4],[31,3,31,5],[32,3,32,5],[33,3,33,5]]}
[" BON DE COMMANDE HOP AND DOWN COLLECTION VELO 2019/20"]
["ZANZIBAR PRODUCTION                                                                                                                                              "]
["ZA Maignon, 2 route de Pitoys"]
["64600 ANGLET "]
["T/ 05.59.23.19.33"]
["info@zanzibar.fr"]
[]
["Agent : "]
["Type de règlement : "]
["Date commande : "]
["Date expédition souhaitée :"]
["N° cde client : "]
[]
[]
["Client Existant :"]
[null,null,"Code Client :"]
["Facturation",null,"Société : ",{"$f":"IFERROR(VLOOKUP(D16,'BD Client'!A2:U154,2,FALSE),\"\")","v":""}]
[null,null,"Client :",{"$f":"IFERROR(VLOOKUP(D16,'BD Client'!A2:U154,3,FALSE),\"\")","v":""}]
[null,null,"Adresse :                                                                                  ",{"$f":"IFERROR(VLOOKUP(D16,'BD Client'!A2:U154,4,FALSE),\"\")","v":""}]
[null,null,"CP : ",{"$f":"IFERROR(VLOOKUP(D16,'BD Client'!A2:U154,5,FALSE),\"\")","v":""},null,"Ville : ",{"$f":"IFERROR(VLOOKUP(D16,'BD Client'!A2:U154,6,FALSE),\"\")","v":""},null,"Pays :",{"$f":"IFERROR(VLOOKUP(D16,'BD Client'!A2:U154,7,FALSE),\"\")","v":""}]
[null,null,"N° Tva intracom :"]
[null,null,"Tel :                                                                            ",{"$f":"IFERROR(VLOOKUP(D16,'BD Client'!A2:U154,8,FALSE),\"\")","v":""},null,null,"Port :",{"$f":"IFERROR(VLOOKUP(D16,'BD Client'!A2:U154,9,FALSE),\"\")","v":""}]
[null,null,"Siret :",null,null,null,"APE :"]
[null,null,"Site Web :"]
[null,null,"Contact :"]
[null,null,"Mail : ",{"$f":"IFERROR(VLOOKUP(D16,'BD Client'!A2:U154,10,FALSE),\"\")","v":""}]
[null,null,"Banque (joindre un RIB) :"]
[]
[null,null,"Code Banque","Code Guichet","Numéro de compte ","Clé RIB","Domiciliation"]
[]
[]
[null,null,"IBAN :"]
[null,null,"BIC : "]
[null,null,"Titulaire :"]
[]
["Livraison",null,"Société : ",{"$f":"IFERROR(VLOOKUP(D16,'BD Client'!A2:U154,19,FALSE),\"\")","v":""}]
[null,null,"Client :",{"$f":"IFERROR(VLOOKUP(D16,'BD Client'!A2:U154,3,FALSE),\"\")","v":""}]
[null,null,"Adresse :                                                                                  ",{"$f":"IFERROR(VLOOKUP(D16,'BD Client'!A2:U154,11,FALSE),\"\")","v":""}]
[null,null,"CP : ",{"$f":"IFERROR(VLOOKUP(D16,'BD Client'!A2:U154,14,FALSE),\"\")","v":""},null,"Ville : ",{"$f":"IFERROR(VLOOKUP(D16,'BD Client'!A2:U154,15,FALSE),\"\")","v":""},null,"Pays :",{"$f":"IFERROR(VLOOKUP(D16,'BD Client'!A2:U154,16,FALSE),\"\")","v":""}]
[null,null,"Tel :                                                                            ",{"$f":"IFERROR(VLOOKUP(D16,'BD Client'!A2:U154,17,FALSE),\"\")","v":""},null,null,"Port : ",{"$f":"IFERROR(VLOOKUP(D16,'BD Client'!A2:U154,18,FALSE),\"\")","v":""}]
{"$rows_left_out":63}
{"sheet":"H&D","index":1,"n_rows":44,"n_cols":13,"rows_kept":44,"cut":false,"hidden":false,"merged":[[43,4,43,9],[38,0,39,0],[42,4,42,9],[41,4,41,9],[34,1,36,1],[34,0,36,0],[9,10,12,10],[4,0,4,1],[5,0,5,1],[6,0,6,1],[7,0,7,1],[8,0,8,12],[5,2,5,6],[9,1,12,1],[9,0,12,0],[9,2,12,2],[9,3,12,3],[9,4,9,9],[9,12,12,12],[9,11,12,11],[0,0,0,12],[7,2,7,12],[2,3,2,6],[4,2,4,6],[3,0,3,1],[3,2,3,6],[5,7,6,12],[2,7,4,12]]}
[" BON DE COMMANDE HOP AND DOWN COLLECTION VELO 2019/2020"]
[]
[]
["Référence plan :"]
["Personnalisation :"]
["Personnalisation (confirmation) :",null,null,null,null,null,null,"Attention à bien respecter les minuscules et les majuscules dans la personnalisation"]
["Commentaire externe :"]
["Commentaire interne :"]
[]
["Désignation","Référence","Coloris","PU €","Tailles",null,null,null,null,null,"Qté Totales","Prix Total €","PV conseillé"]
[null,null,null,null,"XS","S","M","L","XL","XXL"]
[null,null,null,null,4,6,8,10,12,14]
[null,null,null,null,"T1","T2"]
["SOUS VETEMENT"]
["BOXER HOMME (Minimum 3 à la taille)","#022","PLAN ",13.5,null,null,null,null,null,null,{"$f":"SUM(E15:J15)","v":0},{"$f":"PRODUCT(D15*K15)","v":0},29.9]
["BOXER FEMME (Minimum 3 à la taille)","#025","PLAN ",13.5,null,null,null,null,null,null,{"$f":"SUM(E16:J16)","v":0},{"$f":"PRODUCT(D16*K16)","v":0},29.9]
["CULOTTE FEMME (Minimum 2 à la taille) + boite ","#026","PLAN ",12,null,null,null,null,null,null,{"$f":"SUM(E17:J17)","v":0},{"$f":"PRODUCT(D17*K17)","v":0},24.9]
["BOXER HOMME EL RIPIO + Gourde","#019","NOIR",14.9,null,null,null,null,null,null,{"$f":"SUM(E18:J18)","v":0},{"$f":"PRODUCT(D18*K18)","v":0},32.9]
["BOXER FEMME EL RIPIO + Gourde","#021","NOIR",14.9,null,null,null,null,null,null,{"$f":"SUM(E19:J19)","v":0},{"$f":"PRODUCT(D19*K19)","v":0},32.9]
["ACCESSOIRES"]
["UNDER LEGGING ADULTE MIXTE","#222","PLAN",18,null,null,null,null,null,null,{"$f":"SUM(E21:J21)","v":0},{"$f":"PRODUCT(D21*K21)","v":0},39.9]
["KIT CEINTURE boucle plastique + metal (Min 4)","#133","PLAN",9.9,null,null,null,null,null,null,{"$f":"SUM(E22:J22)","v":0},{"$f":"PRODUCT(D22*K22)","v":0},24.9]
["LANYARD","#122","PLAN",1.9,null,null,null,null,null,null,0,0,4.9000000000000004]
["Chaussettes x12   (Minimum 6 à la taille)","#111","PLAN",6.8,null,null,null,null,null,null,{"$f":"SUM(E24:J24)","v":0},{"$f":"PRODUCT(D24*K24)","v":0},14.9]
["HOME"]
["GOURDE ISOTHERME + TASSE ( Minimum 6)","#250","PLAN",11.9,null,null,null,null,null,null,{"$f":"SUM(E26:J26)","v":0},{"$f":"PRODUCT(D26*K26)","v":0},25.9]
["MUGS ( Minimum 36)","#090","PLAN",3.5,null,null,null,null,null,null,{"$f":"SUM(E27:J27)","v":0},{"$f":"PRODUCT(D27*K27)","v":0},9.9]
["SERVIETTE MICROFIBRE 100x50 (Minimum 12) ","#140","PLAN",13.9,null,null,null,null,null,null,{"$f":"SUM(E28:J28)","v":0},{"$f":"PRODUCT(D28*K28)","v":0},29.9]
["TETE & COU"]
["TOUR DE COU 1 + bluff (Minimum 10)","#150","PLAN",6,null,null,null,null,null,null,{"$f":"SUM(E30:J30)","v":0},{"$f":"PRODUCT(D30*K30)","v":0},14.9]
["TOUR DE COU BONNET (Minimum 10)","#152","PLAN",10,null,null,null,null,null,null,{"$f":"SUM(E31:J31)","v":0},{"$f":"PRODUCT(D31*K31)","v":0},24.9]
["TEXTILE"]
["VESTE VELO MANCHE LONGUE ","#240","PLAN",29.9,null,null,null,null,null,null,{"$f":"SUM(E33:J33)","v":0},{"$f":"PRODUCT(D33*K33)","v":0},64.900000000000006]
["VESTE VELO MANCHE COURTE","#241","PLAN",24.9,null,null,null,null,null,null,{"$f":"SUM(E34:J34)","v":0},{"$f":"PRODUCT(D34*K34)","v":0},54.9]
["T-SHIRT MANCHE COURTE","#00553","BLANC",11.9,null,null,null,null,null,null,0,{"$f":"PRODUCT(D35*K35)","v":0},25.9]
[null,null,"GRIS",11.9,null,null,null,null,null,null,0,{"$f":"PRODUCT(D36*K36)","v":0},25.9]
[null,null,"NOIR",11.9,null,null,null,null,null,null,0,{"$f":"PRODUCT(D37*K37)","v":0},25.9]
["PLV"]
["Mannequin fesses ","#301","HOMME",15,null,null,null,null,null,null,{"$f":"SUM(E39:J39)","v":0},{"$f":"PRODUCT(D39*K39)","v":0}]
[null,"#302","FEMME",15,null,null,null,null,null,null,{"$f":"SUM(E40:J40)","v":0},0]
{"$rows_left_out":5}
{"sheet":"BD Client","index":2,"n_rows":152,"n_cols":21,"rows_kept":152,"cut":false,"hidden":true,"merged":[]}
["N°Client","NomSociété","NomClient","Adresse1","CP","Ville","Pays","Téléphone1","Téléphone2","Email","Adresse 1 Livraison","Adresse 2 Livraison","Adresse 3 Livraison","CP Livraison","Ville Livraison","PaysLivraison","Téléphone Livraison","Portable Livraison","NomSociétéLivraison","NomClientLivraison","EmailLivraison"]
[8971,"2 ALPES TONIC","PATRICIA","77 AVENUE DE LA MUZELLE","38860","LES 2 ALPES","FRANCE","04-76-79-00-65","06.07.83.16.90","datonic@orange.fr","2 ALPES TONIC","PETRICIA","77 AVENUE DE LA MUZELLE","38860","LES 2 ALPES","FRANCE","04.76.80.30.53","06.07.83.16.90","2 ALPES TONIC","CARNINO PHILIPPE",""]
[9700,"ALP SPORT 2000","MR MAITRE PHILIPPE","LE PLATEAU DE MOREL","73550","MERIBEL","FRANCE","04.79.08.52.86","06.12.68.61.26","alp.sport@orange.fr","ALPS SPORTS","LE PLATEAU DE MOREL","","73550","MERIBEL","FRANCE","04.79.08.52.86","06.12.68.61.26","ALP SPORT 2000","MAITRE PHILIPPE",""]
[9580,"ALPES SOLEIL SERVICES","AU CHALET DU CADEAUX","CENTRE VARS B 3","5560","VARS LES CLAUX","FRANCE","04.92.46.56.81","06.98.47.02.50","alpes.soleil.services@hotmail.fr","ALPES SOLEIL SERVICES","AU CHALET DES CADEAUX","CENTRE VARS B.3","05560","VARS LES CLAUX","FRANCE","04.92.46.56.81","06.98.47.02.50","AU CHALET DU CADEAU","MONSIEUR COUPANEC",""]
[9844,"ANTARTIK SPORT 2000","MONSIEUR TONY MORIERA","RUE DU VAL CLARET","73320","TIGNES VAL CLARET","FRANCE","04.79.06.50.10","06.89.79.29.93","contact@artik-tignes.com","ANTARTIK SPORT 2000","MAGASIN ARCTIK","RUE DU VAL CLARET","73320","TIGNES VAL CLARET","FRANCE","04.79.06.50.10","06.89.79.29.93","ANTARCTIK SPORT 2000","MONSIEUR TONY MORIERA",""]
[9686,"ANTHRACITE","MADAME GAUDRY CORINE","ROND POINT DES PISTES","73320","TIGNES VAL CLARET","FRANCE","04.79.06.58.49","06.03.56.33.47","anthracite.tignes@free.fr","ANTHRACITE","MADAME GAUDRY CORINE","ROND POINT DES PISTES","73320","TIGNES VAL CLARET","FRANCE","04.79.06.58.49","06.03.56.33.47","ANTHRACITE","MADAME GAUDRY CORINE",""]
[9835,"ARCTIK","MORIERA TONY","RUE DU VAL CLARET","73320","TIGNES VAL CLARET","FRANCE","04.79.06.50.10","06.89.79.29.93","contact@artik-tignes.com","ARCTIK","MAGASIN ARCTIK","RUE DU VAL CLARET","73320","TIGNES VAL CLARET","FRANCE","04.79.06.50.10","06.89.79.29.93","ARCTIK","MONSIEUR TONY MORIERA",""]
[9735,"AUDACE","MONSIEUR ROCHAT ERIC","C.C.COMMERCIAL","73210","BELLE PLAGNE","FRANCE","04.79.09.25.92","06.03.84.24.48","erick.rochat@sfr.fr","AUDACE","CENTRE COMMERCIAL","","73210","BELLE PLAGNE","FRANCE","04.79.09.25.92","06.03.84.24.48","AUDACE","MONSIEUR ROCHAT",""]
[9616,"AUX NEVES ","MONSIEUR MELLA","103 RUE MONSEIGNEUR CONSEIL ","74120","MEGEVE ","FRANCE","04 50 21 14 16 ","06.26.55.43.62","auxneves@aol.com","AUX NEVES","MAGASIN CADEAUX SOUVENIRS","103 RUE MONSEIGNEUR","74120","MEGEVE","FRANCE","04.50.21.14.16","06.26.55.43.62","AUX NEVES","MONSIEUR MELLA",""]
[9720,"AVALANCHES SHOP","MR DEHLINGER DAVID","GALARIE PECLET","73440","VAL THORENS","FRANCE","04.79.00.09.11","06.06.50.35.01","avalancheshop@orange.fr","AVALANCHE SHOP","SPORTS ET CADEAUX","GALERIE PECLET","7340","VAL THORENS","FRANCE","04.79.00.09.11","06.60.50.35.01","AVALANCHE","MONSIEUR DEHLINGER DAVID",""]
[9901,"A-Z SPORTS ET FASHION AG","MONSIEUR NICOLAY ZURBRIGGEN","OBERE DORFSTRASSE 47","3906","SAAS-FEE  CH","","0041 27 531 49 10","","info@sport-art.ch","OBERE DORFSTRASSE 47","","","3906","SAAS-FEE  CH","","0041 27 531 49 10","","A-Z SPORTS ET FASHION AG","MONSIEUR NICOLAY ZURBRIGGEN","nicolay@soprt-art.ch"]
[9860,"BELVEDERE SPORT 2000","MONSIEUR PAUTOT ROGER","","73350","CHAMPAGNY EN VANOISE","FRANCE","04.79.55.05.45","","belvedre-sportq@wanadoo.fr","BELVEDERE SPORT 2000","SPORT 2000","","73350","CHAMPAGNY EN VANOISE","FRANCE","04.79.55.05.45","","BELVEDERE SPORT 2000","MONSIEUR PAUTOT ROGER",""]
[9831,"BERNEX","JACQUIER PIERRE ANDRE","CROC NEIGE LA PALUD","74500","BERNEX","","","","GROUPER AVEC COMMANDE 17151","","","","","","","","","","",""]
[9855,"BEROD SPORT","MR BEROD","LE CERNIX","73590","CREST VOLLAND","FRANCE","04.79.31.70.85","06.16.45.22.50","berod-sports@wanadoo.fr","BEROD SPORT","LE CERNIX","COHENNOZ","73590","CREST VOLLAND","FRANCE","04.79.31.70.85","06.16.45.22.50","BEROD SPORT","MONSIEUR BEROD",""]
[9925,"BERTHET SPORT 2000","MADAME BERTHET","384 RUE PASTEUR","39220","LES ROUSSES","","03.84.60.00.68","","berthet.sport2000@orange.fr","384 RUE PASTEUR","","","39220","LES ROUSSES","","03.84.60.00.68","","BERTHET SPORT 2000","MADAME BERTHET","berthet.sport2000@orange.fr"]
[9825,"BESSON SPORT S.R.L.","MONSIEUR CARLO BESSON","10 VIA CLOTES","10050","SAUZE D' OULX","ITALIE","0039 0122 85 07 86","","info@bessonsport.it","BESSON SPORT S.R.L.","MONSIUER CARLO BESSON","10 VIA CLOTES","10050","SAUZE D'OULX","ITALIE","Italie","0039 0122 85 07 86","BESSON SPORTS","MONSIEUR BESSON CARLO",""]
[9708,"BOITE A SKI","MONSIEUR WENDLING","LES AIRELLES","38114","OZ EN OISANS","FRANCE","04.76.79.52.34","06.60.59.82.35","boitaskisport2000@hotmail.com","BOITE A SKIS","SPORT 2000","LES AIRELLES","38114","OZ EN OISANS","FRANCE","04.76.79.52.34","06.60.59.82.35","BOITE A SKIS","MONSIEUR WENDLING PASCAL",""]
[9715,"BORREL SPORTS","SPORT 2000","LES BRUYERES","73440","LES MENUIRES","FRANCE","04.79.00.62.58","","sport2000.lesmenuires@orange.fr","BORREL SPORTS","SPORT 2000","LES BRUYERES","73440","LES MENUIRES","FRANCE","04.79.00.62.58","","BORREL SPORT 2000","MADAME CHUPIN",""]
[9729,"BOSSONNET PRO SHOP","MADAME SEIMETZ","1 ROUTE DES CONFINS","74220","LA CLUSAZ","FRANCE","04.50.02.41.18","","bossonnet-proshop@orange.fr","BOSSONNET PRO SHOP","MADAME SEIMETZ","1 ROUTE DES CONFINS","74220","LA CLUSAZ","FRANCE","04.50.02.41.18","","BOSSONNET PRO SHOP","MADAME SEIMETZ",""]
[9717,"BOUDU SPORTS","MR MINAZION FABRICE","SKISET","73210","LA PLAGNE 1800","FRANCE","04.79.09.02.84","","boudusport@yahoo.fr","BOUDU SPORTS","MONSIEUR MINAZIO FABRICE","SKISET","73210","LA PLAGNE 1800","FRANCE","04.79.09.02.84","","BOUDU SPORTS","MONSIEUR MINAZIO FABRICE",""]
[9800,"BOUVET SPORTS","MONSIEUR BOUVET","CHEF LIEU","74360","ABONDANCE","FRANCE","04.50.73.06.98","06.70.92.68.35","bouvetsports@wanadoo.fr","BOUVET SPORTS","CHEF LIEU","CENTRE VILLAGE","74360","ABONDANCE","FRANCE","04.50.73.06.98","06.70.92.68.35","BOUVET SPORTS","MADAME BOUVET JACQUELINE",""]
[9888,"CAZA BAMBOO","MONSIEUR FEREOL DENIS","RUE JEAN CALOT","97137","TERRE DE HAUT","GUADELOUPE","05.90.99.88.43","06.90.58.73.68","cazabamboo@orange.fr","CAZA BAMBOO","MONSIEUR FERREOL","RUE JEAN CALOT","97137","TERRE DE HAUT","GUADELOUPE","05.90.99.88.43","06.90.58.73.68","CAZA BAMBOO","MONSIEUR FEREOL DENIS","FAIRE EXPEDITION EN COLISSIMO"]
[6650,"CHABRE SPORTS","MONSIEUR CHABRE ARNAUD","186 ROUTE DE GRENOBLE","5220","MONETIER LES BAINS","FRANCE","04 92 24 44 56","06.60.99.79.82","chabre.sports@wanadoo.fr","CHABRE SPORTS","MONSIEUR CHABRE ARNAUD","186 ROUTE DE GRENOBLE","5220","MONETIER LES BAINS","FRANCE","04 92 24 44 56","06 60 99 79 82 ","CHABRE SPORTS","MONSIEUR CHABRE ARNAUD",""]
[9711,"CHAUD SPORTS","MR CHAUD MICHEL","FRONT DE NEIGE","5290","PUY SAINT VINCENT 1800","FRANCE","04.92.23.51.55","06.68.26.63.41","chaudsport1600@wanadoo.fr","CHAUD SPORTS","MONSIEUR CHAUD MICHEL","FRONT DE NEIGE","5290","PUY SAINT VINCENT 1800","FRANCE","04.92.23.51.55","06.68.26.63.41","CHAUD SPORTS","MONSIEUR CHAUD MICHEL",""]
[9814,"CHAUDANNE SPORTS","MR.MME. NANTET","ROUTE ALBERT GACON","73550","MERIBEL","FRANCE","04.79.08.89.12","06.72.41.59.09","contact@chaudanne-sport.com","CHAUDANNE SPORTS","MONSIEUR NANTET PHILIPPE","ROUTE ALBERT GACON","73550","MERIBEL","FRANCE","04.79.08.89.12","06.72.41.59.09","CHAUDANNE SPORTS","MONSIEUR NANTET PHILIPPE",""]
[6853,"DANIEL CRUZ SPORTS SARL","Daniel Cruz","chemin de l'Etriga","74390","CHATEL","","04 50 81 35 24","","cruzda@wanadoo.fr","","","","","","","04 50 81 35 24","","","",""]
[9854,"DUCREY SPORT","MADAME DUCREY KARINE","550 AVENUE DES J.O","73620","LES SAISIES","FRANCE","04.79.38.90.33","","contact@ ducreysports.com","DUCREY SPORTS","MADAME DUCREY KARINE","550 AVENUE DES JEUX","73260","LES SAISIES","FRANCE","04.79.38.90.33","","DUCREY SPORTS","MADAME DUDREY KARINE","PAYE PAR VIREMENT"]
[7001,"ELLE ET LUI","MONSIEUR PARROUR JEAN LUC","RUE DES TOVETS","73120","COURCHEVEL 1850","FRANCE","04.79.08.24.73","06.62.12.29.62","jean-luc.parrour@wanadoo.fr","ELLE ET LUI","MONSIEUR PARROUR JEAN LUC","RUE DES TOVETS","73120","COURCHEVEL 1850","FRANCE","04.79.08.24.73","06 62 12 29 62","ELLE ET LUI","MONSIEUR PARROUD JEAN LUC",""]
[9801,"EURL BELAMIX","MONSIEUR SUIFFET","LES RHODOS","73480","LANSLEBOURG","FRANCE","04.79.05.90.69","06.86.01.60.71","suiffet.pascal@wanadoo.fr","LES RODOS","MONSIEUR SUIFFET PASCAL","RUE PRINCIPALE","73480","LANSLEBOURG","FRANCE","04.79.05.90.69","06.86.01.60.71","LES RHODOS","MONSIEUR SUIFFET PASCAL",""]
[8496,"EURL MDS","MICHEL","SKIWAVE SKISET","73120","LA TANIA COURCHEVEL","FRANCE","04 79 08 81 23","06.82.01.54.18","skiset.latania@wanadoo.fr","TANIA SPORTS","MONSIEUR MICHEL","ALPISKI SKISET","73120","LA TANIA","FRANCE","04 79 08 81 23","06 82 01 54 18","ALPISKI","MONSIEUR MICHEL",""]
[6666,"EURL SALINAE","MADAME Sandra ANSELMET","CADEAU SOUVENIR CHEZ DANIEL","73480","BONNEVAL SUR ARC","FRANCE","04 79 05 96 33","06.77.36.09.85","chezdanielcado@live.fr","CHEZ DANIEL SOUVENIRS","MADAME SANDRA ANSELMET","ENTREE DU VILLAGE","73480","BONNEVAL SUR ARC","FRANCE","04 79 05 96 33","06 77 36 09 85","CHEZ DANIEL","MADAME SANDRA ANSELMET",""]
[9609,"GILBERT SPORT","","LES VERNEY","73450","","","04 79 59 02 77","","gilbertsports@yahoo.fr","","","","","","","","","","",""]
[9839,"GILBERT SPORTS","MADAME BEAUMONT VALERIE","LES VERNETS","73450","VALLOIRE","FRANCE","04.79.59.02.77","","gilbertsports@yahoo.fr","GILBERT SPORTS","MADAME BEAUMONT VALERIE","LES VERNETS","73450","VALLOIRE","FRANCE","04.79.59.02.77","","GILBERT SPORTS","MADAME BEAUMONT VALERIE",""]
[9849,"GLISS META CONCEPT","MME LUCIE JURCEVIC","1 PLACE XAVIER AUTHIER","25370","METABIEF","FRANCE","03.81.39.43.37","06.88.46.71.46","glisscafe@orange.fr","GLISS META CONCEPT","MADAME LUCIE JURCEVIC","1 PLACE XAVIER AUTHIER","25370","METABIEF","FRANCE","03.81.39.43.37","06.88.46.71.46","GLISS META CONCEPT","MADAME LUCIE JURCEVIC",""]
[7362,"HORIZON SARL","MONSIEUR BERMOND CHRISTIAN","PASSAGE DE L'OLYMPE","73570","BRIDES LES BAINS","","04.79.55.26.25","","cber10@orange.fr","PASSAGE DE L'OLYMPE","","","73570","BRIDES LES BAINS","","04.79.55.26.25","06.12.37.42.26","HORIZON SARL","MONSIEUR BERMOND CHRISTIAN","cber10@orange.fr"]
[9882,"inter","CHEZ INTERSPORT","","73700","BOURG SAINT MAURICE","","04.79.04.04.30","","contact@intersport-bourg.com","GALERIE COMMERCIALE ARC 1600         ZC SUPER U","","","73700","BOURG SAINT MAURICE","","04.79.07.70.08","","S.A.S. SEJE SPORTS","CHEZ INTERSPORT","contact.centre@intersport-arc1600.com"]
[9871,"INTERSPORT ARCS 1800","SPORTS BOUTIQUE","LES VILLARDS","73700","ARCS 1800","FRANCE","04.79.04.04.30","06.95.84.37.79","antoine@intersport-bourg.com","INTERSPORT","SPORTS BOUTIQUE ","LES VILLARDS","73700","ARCS 1800","FRANCE","04.79.04.13.04","06.95.84.37.79","INTERSPORT","MADAME AUDREY BOUTEILLER",""]
[9875,"INTERSPORT BOURG ST MAURICE","","Zone Commerciale Super U","73700","BOURG ST MAURICE","FRANCE","04.79.04.04.30","","antoine@intersport-bourg.com","INTERSPORT","","ZONE COMMERCIALE SUPER U","73700","BOURG SAINT MAURICE","FRANCE","04.79.04.13.04","","INTERSPORT","MONSIEUR ANTOINE GAIMARD",""]
[9874,"INTERSPORT BRIANCON","MME MELANIE BRUM","187 RUE DES TABELLIONS","5100","BRIANCON","FRANCE","04.79.25.57.90","06.70.31.90.92","briancon@reseau-intersport.fr","INTERSPORT","MADAME MELANIE BRUM","187 RUE DES TABELLIONS","5100","BRIANCON","FRANCE","04.79.25.57.90.","06.70.31.90.92","INTERSPORT","MADAME MELANIE BRUM",""]
[9911,"INTERSPORT CAUTERETS","BENOIT GUITTON","","","","","","0607471253","benoitguitton@orange.fr","CENTRE COMMERCIAL CARREFOUR - LIEU DIT LE CONCE","","","65110","CAUTERETS","","562929940","","INTERSPORT CAUTERETS","BENOIT GUITTON",""]
{"$rows_left_out":112}